{"text_format":"1","workbook":"xlsx","n_sheets":6,"sheets":["Instructions","Data Entry Sheet","Marking Sheet","Application Form","Test Details","CSV Export"],"not_rendered":{"charts":0,"images":4,"macros":1,"external_links":1,"defined_names":475,"comments":0,"pivot_tables":0},"unopened":[],"bounds":{"document_bytes":16777216,"sheet_cells":100000,"rows_first":2000,"rows_last":500,"rows_between":2000,"halvings":0,"cell_chars":16384,"cell_head_chars":4096},"cells_cut":0,"cells_raw":0,"read":"whole","date_system":"1900"}

{"sheet":"Instructions","index":0,"n_rows":24,"n_cols":4,"rows_kept":24,"cut":false,"hidden":false,"merged":[]}
["COMPUTER/EXCEL SET UP REQUIREMENTS"]
[]
["1.","The forms must be saved on to a computer to work successfully.  The macros won't work on a form which is opened from OneDrive or from an attachment to an email."]
[]
["2.","The computer must have Excel 2010 (or later) installed.  The macros will not work in Libre Office."]
[]
["3.","Macros must be enabled on the computer.  Open Excel then go to:"]
[null,"(a)","File | Options | Trust Centre | Turst Centre Settings"]
{"$rows_left_out":17}
{"sheet":"Data Entry Sheet","index":1,"n_rows":146,"n_cols":54,"rows_kept":146,"cut":false,"hidden":false,"merged":[[58,0,58,2],[52,0,52,2],[55,3,55,5],[52,18,53,18],[51,0,51,5],[44,21,45,22],[54,3,54,5],[52,3,52,5],[55,0,55,2],[53,3,53,5],[55,7,55,12],[56,7,56,12],[44,2,44,5],[45,2,45,5],[49,2,49,5],[44,7,44,11],[45,7,45,11],[46,7,46,11],[53,15,66,16],[30,2,30,5],[27,0,27,4],[27,5,27,12],[29,0,29,4],[28,0,28,4],[28,9,28,12],[25,0,25,12],[31,2,31,5],[35,2,35,5],[31,7,31,10],[31,11,31,12],[33,2,33,5],[34,2,34,5],[32,7,32,11],[38,2,38,5],[39,2,39,5],[47,7,47,11],[48,7,48,11],[49,7,49,11],[41,2,41,5],[40,2,40,5],[42,7,42,11],[43,7,43,11],[42,2,42,5],[39,7,39,11],[40,7,40,11],[56,36,56,37],[56,38,56,39],[60,27,61,27],[62,27,63,27],[60,29,61,29],[62,29,63,29],[60,31,61,31],[62,31,63,31],[56,27,56,28],[56,34,56,35],[71,29,71,30],[71,31,71,32],[68,29,68,30],[56,31,56,32],[55,23,55,25],[75,29,75,30],[75,31,75,32],[56,29,56,30],[59,23,59,25],[74,27,74,28],[74,29,74,30],[74,31,74,32],[71,27,71,28],[75,27,75,28],[65,23,65,25],[41,27,42,28],[39,27,40,28],[38,23,39,23],[38,24,39,24],[38,25,39,25],[41,23,41,25],[55,27,55,32],[60,23,60,25],[63,23,63,25],[45,23,45,25],[42,21,43,22],[42,23,43,23],[42,24,43,24],[41,7,41,11],[38,7,38,11],[40,21,41,22],[33,23,33,25],[38,17,40,17],[34,21,36,21],[38,21,39,22],[34,23,34,25],[35,23,36,23],[35,24,36,24],[35,25,36,25],[30,22,36,22],[32,23,32,25],[30,7,30,12],[16,21,16,22],[7,18,8,18],[8,25,9,25],[8,26,9,26],[8,27,9,27],[11,25,12,27],[7,25,7,27],[14,16,14,17],[13,19,13,20],[13,21,13,22],[12,16,12,17],[7,16,9,17],[10,16,10,17],[11,16,11,17],[13,16,13,17],[12,23,12,24],[22,8,22,12],[29,5,29,8],[33,7,33,11],[34,7,34,11],[35,7,35,11],[32,2,32,5],[36,2,36,5],[17,36,17,38],[26,23,26,25],[17,2,17,3],[32,27,33,28],[31,27,31,28],[34,27,35,28],[36,29,38,29],[36,30,38,30],[36,7,36,11],[37,7,37,11],[17,5,17,6],[18,5,18,6],[17,8,17,9],[18,8,18,9],[26,2,26,11],[28,5,28,8],[37,2,37,5],[25,44,25,46],[25,48,25,50],[30,41,30,42],[27,41,27,42],[26,41,26,42],[25,41,25,42],[30,44,30,46],[27,27,27,29],[28,41,28,42],[28,48,28,50],[26,44,26,46],[28,44,28,46],[27,44,27,46],[30,48,30,50],[26,27,26,29],[30,27,30,28],[1,1,1,12],[2,1,2,12],[11,1,11,12],[9,1,9,12],[10,1,10,12],[12,1,12,12],[8,1,8,12],[14,3,14,7],[16,0,16,12],[3,1,5,12],[6,1,6,12],[15,3,15,6],[7,1,7,12],[2,19,2,20],[6,19,6,20],[15,32,15,34],[7,23,9,24],[8,21,8,22],[9,21,9,22],[10,21,10,22],[7,21,7,22],[11,21,11,22],[7,19,9,20],[10,19,10,20],[11,19,11,20],[14,25,15,26],[14,27,15,28],[14,29,15,30],[13,23,13,24],[12,19,12,20],[12,21,12,22],[10,23,10,24],[11,23,11,24],[7,15,9,15],[52,15,52,16],[47,2,47,5],[48,2,48,5],[52,17,54,17],[42,25,44,25],[46,25,48,25],[51,21,52,22],[53,0,54,2],[49,23,49,24],[46,2,46,5],[43,2,43,5],[46,23,47,23],[46,24,47,24],[50,23,51,23],[50,24,51,24],[50,7,50,11],[50,2,50,5],[54,23,54,25],[46,21,46,22],[26,0,26,1],[20,8,20,9],[19,2,19,4],[20,10,20,12],[141,22,142,22],[141,23,142,25],[68,15,76,16],[60,0,60,2],[61,0,61,2],[62,0,62,2],[56,3,56,5],[57,3,57,5],[56,0,57,2],[66,17,68,17],[67,15,67,16],[64,1,64,11],[65,1,65,11],[58,3,58,5],[66,7,67,11],[88,23,89,25],[59,0,59,2],[85,23,85,25],[82,23,82,25],[83,23,83,25],[84,23,84,25],[76,23,76,25],[64,23,64,25],[75,23,75,25],[143,22,143,25],[144,23,144,25],[145,23,145,25],[62,23,62,25],[61,23,61,25],[66,23,66,25],[70,23,70,25],[71,23,71,25],[72,23,72,25],[73,23,73,25],[74,23,74,25],[129,23,129,25],[133,23,133,25],[134,23,134,25],[135,23,135,25],[136,22,136,25],[137,23,137,25],[138,23,138,25],[139,23,139,25],[140,23,140,25],[86,23,86,25],[88,22,89,22],[77,23,77,25],[81,23,81,25]]}
[null,null,null,null,null,null,null,null,null,null,null,null,null,null,"Hide","Hide","Hide","Hide","Hide","Hide","Hide","Hide","Hide","Hide","Hide","Hide","Hide","Hide","Hide","Hide","Hide","Hide","Hide","Hide","Hide","Hide","Hide","Hide","Hide","Hide","Hide","Hide","Hide","Hide","Hide","Hide","Hide","Hide","Hide","Hide","Hide","Hide","Hide","Hide"]
[null,"SKATE AUSTRALIA PROFICIENCY TEST"]
[null,"DATA ENTRY SHEET",null,null,null,null,null,null,null,null,null,null,null,null,null,null,null,null,null,"Previous Test Date =",null,{"$f":"Previous_Test_Date","v":"."}]
[null,"SA PROFICIENCY TEST FORM NS - 2025-01 NEW STRUCTURE - FREE SKATING\n(requires Microsoft Excel 2010 or later installed on the computer)"]
[]
[]
[null,"Cells with a blue background have a drop down list for selection of data",null,null,null,null,null,null,null,null,null,null,null,null,null,null,{"$f":"Test_Date_Y_N","v":"NO"},null,null,"Test Date = ",null,{"$f":"Test_Date","v":"00:00:00"}]
["NAME:",null,null,null,null,null,null,null,null,null,null,null,null,null,null,"First Free Skating test - no previous attempt at this test","If Last Test Type is Old Free Skating & C",null,"If Last Test was Old Free Skating & NYC","If Last Test was New Free Skating & C",null,"Last Test New Free Skating & NYC",null,"Skate Ups Free Skating\n\nIf Last Test was New Free Skating & Skate Up",null,"Test Held"]
{"$rows_left_out":139}
{"sheet":"Marking Sheet","index":2,"n_rows":224,"n_cols":17,"rows_kept":224,"cut":false,"hidden":false,"merged":[[221,8,221,14],[222,6,222,7],[222,8,222,14],[166,0,166,14],[206,4,207,14],[207,0,207,3],[201,8,201,14],[189,11,189,14],[221,0,221,5],[222,0,222,5],[209,6,209,7],[211,6,211,7],[212,6,212,7],[214,6,214,7],[218,6,218,7],[219,6,219,7],[220,6,220,7],[221,6,221,7],[218,0,218,5],[219,0,219,5],[220,0,220,5],[195,3,195,7],[196,0,196,14],[197,0,197,3],[16,3,16,9],[119,10,120,10],[92,0,92,14],[87,6,87,9],[31,0,31,14],[86,0,86,14],[87,0,87,2],[87,3,87,5],[47,0,47,14],[48,0,48,14],[49,0,49,14],[32,0,32,2],[32,3,32,5],[33,0,33,2],[33,3,33,5],[33,6,33,9],[33,11,33,14],[45,0,45,14],[42,0,42,14],[24,13,24,14],[26,13,26,14],[23,3,23,9],[59,0,59,1],[32,6,32,9],[190,3,190,7],[192,3,192,7],[193,3,193,7],[8,0,8,14],[9,13,10,14],[11,3,11,9],[18,3,18,9],[19,3,19,9],[20,3,20,9],[21,3,21,9],[9,0,10,0],[9,1,10,1],[9,2,10,2],[9,3,10,9],[9,11,9,12],[17,3,17,9],[12,3,12,9],[9,10,10,10],[13,3,13,9],[189,3,189,7],[190,11,190,14],[91,0,91,3],[14,3,14,9],[12,13,12,14],[199,0,200,7],[200,8,200,14],[191,11,191,14],[192,11,192,14],[193,11,193,14],[194,11,194,14],[209,0,209,5],[209,8,209,14],[202,8,202,14],[203,0,204,7],[203,8,203,14],[204,8,204,14],[208,0,208,14],[205,0,205,14],[206,0,206,3],[201,0,202,7],[191,3,191,7],[195,11,195,14],[194,3,194,7],[197,4,198,14],[198,0,198,3],[219,8,219,14],[220,8,220,14],[210,0,210,5],[210,6,210,7],[211,0,211,5],[212,0,212,5],[213,0,213,5],[210,8,210,14],[211,8,211,14],[212,8,212,14],[213,8,213,14],[213,6,213,7],[214,0,214,5],[215,0,215,5],[216,0,216,5],[215,6,215,7],[216,6,216,7],[217,6,217,7],[214,8,214,14],[215,8,215,14],[217,0,217,5],[216,8,216,14],[217,8,217,14],[218,8,218,14],[185,3,185,7],[186,3,186,7],[187,3,187,7],[188,3,188,7],[70,13,70,14],[71,3,71,9],[152,0,152,14],[153,0,153,14],[71,13,71,14],[72,3,72,9],[72,13,72,14],[82,13,82,14],[73,13,73,14],[74,3,74,9],[74,13,74,14],[75,3,75,9],[75,13,75,14],[76,3,76,9],[76,13,76,14],[77,3,77,9],[77,13,77,14],[73,3,73,9],[111,0,111,14],[90,0,90,3],[185,11,185,14],[186,11,186,14],[187,11,187,14],[188,11,188,14],[90,4,91,14],[167,0,167,14],[169,0,169,1],[169,2,169,5],[169,11,169,12],[169,13,169,14],[98,0,98,14],[99,0,99,14],[105,0,105,14],[112,0,112,14],[114,0,114,1],[114,2,114,5],[114,11,114,12],[114,13,114,14],[108,0,108,14],[115,0,115,1],[106,0,106,14],[107,0,107,14],[96,0,96,14],[116,0,116,1],[1,0,1,14],[2,0,2,14],[4,0,4,1],[4,11,4,12],[6,0,6,1],[6,2,6,6],[5,0,5,1],[5,11,5,12],[7,12,7,14],[4,13,4,14],[5,13,5,14],[4,2,4,5],[5,2,5,5],[7,1,7,2],[7,5,7,6],[7,7,7,9],[11,13,11,14],[13,13,13,14],[14,13,14,14],[15,13,15,14],[16,13,16,14],[15,3,15,9],[62,1,62,2],[62,5,62,6],[62,7,62,9],[17,13,17,14],[18,13,18,14],[19,13,19,14],[20,13,20,14],[27,3,27,9],[28,3,28,9],[29,3,29,9],[26,3,26,9],[30,3,30,9],[21,13,21,14],[27,13,27,14],[22,3,22,9],[22,13,22,14],[23,13,23,14],[25,13,25,14],[32,11,32,14],[59,2,59,5],[59,11,59,12],[59,13,59,14],[24,3,24,9],[25,3,25,9],[56,0,56,14],[57,0,57,14],[28,13,28,14],[29,13,29,14],[30,13,30,14],[37,0,37,14],[36,0,36,3],[35,4,36,14],[34,0,34,14],[35,0,35,3],[38,0,39,14],[40,0,40,14],[41,0,41,14],[46,0,46,14],[50,0,50,14],[51,0,51,14],[43,0,43,14],[44,0,44,14],[52,0,52,14],[60,11,60,12],[60,13,60,14],[89,0,89,14],[66,3,66,9],[66,13,66,14],[67,3,67,9],[67,13,67,14],[64,0,65,0],[64,1,65,1],[64,2,65,2],[64,3,65,9],[64,11,64,12],[64,13,65,14],[68,3,68,9],[68,13,68,14],[69,3,69,9],[69,13,69,14],[70,3,70,9],[87,11,87,14],[62,12,62,14],[63,0,63,14],[64,10,65,10],[61,0,61,1],[61,2,61,6],[118,0,118,14],[119,0,120,0],[119,1,120,1],[119,2,120,2],[119,3,120,9],[119,11,119,12],[119,13,120,14],[117,7,117,9],[117,5,117,6],[101,0,101,14],[102,0,102,14],[103,0,103,14],[104,0,104,14],[117,1,117,2],[115,2,115,5],[115,11,115,12],[115,13,115,14],[100,0,100,14],[116,2,116,6],[117,12,117,14],[121,3,121,9],[121,13,121,14],[122,3,122,9],[122,13,122,14],[123,3,123,9],[123,13,123,14],[124,3,124,9],[124,13,124,14],[125,3,125,9],[125,13,125,14],[126,3,126,9],[126,13,126,14],[127,3,127,9],[127,13,127,14],[128,3,128,9],[128,13,128,14],[129,3,129,9],[129,13,129,14],[130,3,130,9],[130,13,130,14],[131,3,131,9],[131,13,131,14],[132,3,132,9],[132,13,132,14],[133,3,133,9],[133,13,133,14],[134,3,134,9],[134,13,134,14],[135,3,135,9],[135,13,135,14],[136,3,136,9],[136,13,136,14],[137,3,137,9],[137,13,137,14],[138,3,138,9],[138,13,138,14],[139,3,139,9],[139,13,139,14],[140,3,140,9],[140,13,140,14],[141,0,141,14],[142,0,142,2],[142,3,142,5],[142,6,142,9],[142,11,142,14],[143,0,143,2],[143,3,143,5],[143,6,143,9],[143,11,143,14],[144,0,144,14],[145,0,145,3],[145,4,146,14],[146,0,146,3],[147,0,147,14],[163,0,163,14],[158,0,158,14],[159,0,159,14],[160,0,160,14],[161,0,161,14],[162,0,162,14],[155,0,155,14],[156,0,156,14],[157,0,157,14],[151,0,151,14],[154,0,154,14],[150,0,150,14],[148,0,149,14],[170,0,170,1],[170,2,170,5],[170,11,170,12],[170,13,170,14],[171,0,171,1],[171,2,171,6],[172,12,172,14],[173,0,173,14],[174,0,175,0],[174,1,175,1],[174,2,175,2],[174,3,175,7],[174,11,175,14],[172,1,172,2],[172,5,172,6],[172,7,172,9],[174,9,174,10],[174,8,175,8],[176,3,176,7],[177,3,177,7],[178,3,178,7],[179,3,179,7],[180,3,180,7],[182,11,182,14],[183,11,183,14],[184,11,184,14],[176,11,176,14],[177,11,177,14],[178,11,178,14],[179,11,179,14],[180,11,180,14],[181,11,181,14],[181,3,181,7],[182,3,182,7],[183,3,183,7],[184,3,184,7],[53,0,53,14],[97,0,97,14],[83,3,83,9],[83,13,83,14],[84,3,84,9],[84,13,84,14],[85,3,85,9],[85,13,85,14],[78,3,78,9],[78,13,78,14],[79,3,79,9],[79,13,79,14],[80,3,80,9],[80,13,80,14],[81,3,81,9],[81,13,81,14],[82,3,82,9],[88,0,88,2],[88,3,88,5],[88,6,88,9],[88,11,88,14],[93,0,94,14],[60,0,60,1],[60,2,60,5]]}
[]
["SKATE AUSTRALIA PROFICIENCY TEST"]
["MARKING SHEET"]
[]
[{"$f":"Label_Name","v":"NAME:"},null,{"$f":"Skater_Name","v":0},null,null,null,null,null,null,null,null,{"$f":"Label_SA_No","v":"SA NO:"},null,{"$f":"SA_Number","v":0}]
[{"$f":"Label_Test_Centre","v":"TEST CENTRE:"},null,{"$f":"Test_Centre","v":0},null,null,null,null,null,null,null,null,{"$f":"Label_Test_Date","v":"TEST DATE:"},null,{"$f":"Test_Date","v":"00:00:00"}]
[null,null,"(for Dance/Freedance/Freeskating Pairs only)"]
["TEST",{"$f":"Test_Discipline","v":""},null,{"$f":"Label_Test_No","v":"TEST NO:"},{"$f":"Test_Number","v":""},{"$f":"Label_Routine_Time","v":"Time:"},null,{"$f":"Routine_Time","v":""},null,null,null,null,"Judge 1"]
{"$rows_left_out":217}
{"sheet":"Application Form","index":3,"n_rows":44,"n_cols":14,"rows_kept":44,"cut":false,"hidden":false,"merged":[[16,1,16,6],[36,3,36,6],[35,3,35,6],[17,1,17,6],[18,1,18,6],[24,1,24,6],[25,1,25,6],[35,0,35,2],[32,1,32,6],[33,1,33,6],[34,1,34,6],[27,1,27,6],[28,1,28,6],[29,1,29,6],[30,1,30,6],[31,1,31,6],[16,13,16,14],[17,13,18,14],[19,13,20,14],[21,13,22,14],[24,13,24,14],[43,7,44,9],[41,3,41,6],[38,13,38,17],[36,0,41,2],[42,0,42,6],[43,0,44,2],[43,3,44,6],[31,13,31,17],[33,13,33,17],[17,12,18,12],[25,13,26,14],[36,13,36,17],[19,12,20,12],[21,12,22,12],[25,12,26,12],[1,0,1,9],[2,0,2,9],[6,8,6,9],[13,7,13,9],[10,8,10,9],[13,0,14,0],[13,1,14,6],[7,8,7,9],[10,5,10,7],[11,5,12,7],[11,8,12,9],[8,5,9,5],[6,1,6,3],[7,1,7,3],[8,1,8,3],[10,1,10,3],[8,6,9,6],[8,7,9,7],[8,8,9,9],[40,3,40,6],[39,3,39,6],[15,1,15,6],[19,1,19,6],[20,1,20,6],[12,1,12,3],[21,1,21,6],[22,1,22,6],[23,1,23,6],[11,1,11,3],[37,3,37,6],[38,3,38,6],[26,1,26,6]]}
[]
["SKATE AUSTRALIA PROFICIENCY TEST"]
["APPLICATION FORM"]
[]
[]
["(HIDE)"]
[{"$f":"Label_Name","v":"NAME:"},{"$f":"Skater_Name","v":0}]
[{"$f":"Label_Club","v":"CLUB:"},{"$f":"Club","v":0},null,null,null,null,null,{"$f":"Label_SA_No","v":"SA NO:"},{"$f":"SA_Number","v":0}]
{"$rows_left_out":37}
{"sheet":"Test Details","index":4,"n_rows":328,"n_cols":26,"rows_kept":328,"cut":false,"hidden":true,"merged":[]}
["Test #",null,"Item #","Full Item - D:U - 1","D:W - 2","Item Description  D:W - 3","D:W - 4","D:W - 5","D:W - 6","D:W - 7","D:W - 8","D:W - 9","D:W - 10","D:W - 11","D:W - 12","D:W - 13","D:W - 14","D:W - 15","D:W - 16","D:W - 17","D:W - 18","Minimum Mark  D:W - 19","Passing Grade  D:W - 20","Routine Time  D:W - 21","Award  D:W - 22","Award  D:W - 23"]
["Free Skating",null,null,null,null,null,null,null,"Total No. Jumps Required\n(Test 4 up exclude connecting jumps)","No. Jumps Required for WOMEN\n(Test 4 up excl connecting jumps)","No. Jumps Required for MEN\n(Test 4 up excl connecting jumps)","No. Combo Jumps Required","No. Jumps allowed Combo 1","No. Jumps allowed Combo 2","No. Solo Spins Required","No. Combo Spins Required","No. Spin elements required","Footwork sequence required","Choreo sequence required","Minimum Components","Minimum Individual Component"]
["FS01",{"$f":"$A$2&A3","v":"Free SkatingFS01"},"1.",{"$f":"B3&C3","v":"Free SkatingFS011."},null,null,null,null,null,null,null,null,null,null,null,null,null,null,null,null,null,5,11,"2 mins 30 secs (-10 secs) to 4 mins (+10 secs)","1st Bronze Bar","Bronze"]
["FS02",{"$f":"$A$2&A4","v":"Free SkatingFS02"},"1.","Free SkatingFS021.",null,null,null,null,null,null,null,null,null,null,null,null,null,null,null,null,null,5,12,"2 mins 30 secs (-10 secs) to 4 mins (+10 secs)","2nd Bronze Bar","Bronze"]
["FS03","Free SkatingFS03","1.","Free SkatingFS031.",null,null,null,null,null,null,null,null,null,null,null,null,null,null,null,null,null,5,13,"2 mins 30 secs (-10 secs) to 4 mins (+10 secs)","Bronze Medal","Bronze"]
["FS04","Free SkatingFS04","1.","Free SkatingFS041.",null,null,null,null,null,null,null,null,null,null,null,null,null,null,null,null,null,5,14,"2 mins 30 secs (-10 secs) to 4 mins (+10 secs)","1st Silver Bar","Silver"]
["FS05","Free SkatingFS05","1.","Free SkatingFS051.",null,null,null,null,null,null,null,null,null,null,null,null,null,null,null,null,null,5,14,"2 mins 30 secs (-10 secs) to 4 mins (+10 secs)","2nd Silver Bar","Silver"]
["FS06","Free SkatingFS06","1.","Free SkatingFS061.",null,null,null,null,null,null,null,null,null,null,null,null,null,null,null,null,null,5,14,"2 mins 30 secs (-10 secs) to 4 mins (+10 secs)","Silver Medal","Silver"]
{"$rows_left_out":321}
{"sheet":"CSV Export","index":5,"n_rows":12,"n_cols":76,"rows_kept":12,"cut":false,"hidden":true,"merged":[]}
["Name","Member #","Club","Venue","Test Date ","Partner","Date of Previous Test","Discipline","Test","Test Type","Award","Fee","Max Time","Min Mark","Passing Grade","Fig Num1","Item Desc1","Fig Num2","Item Desc2","Fig Num3","Item Desc3","Fig Num4","Item Desc4","Fig Num5","Item Desc5","Fig Num6","Item Desc6","Fig Num7","Item Desc7","Fig Num8","Item Desc8","Mark11","Mark21","Mark31","Mark12","Mark22","Mark32","Mark13","Mark23","Mark33","Mark14","Mark24","Mark34","Mark15","Mark25","Mark35","Mark16","Mark26","Mark36","Mark17","Mark27","Mark37","Mark18","Mark28","Mark38","Total1","Total2","Total3","Result","Comments","Content1","Content2","Content3","Content4","Content5","Content6","Content7","Content8","Content9","Content10","Content11","Judge1","Judge2","Judge3","Referee","Gender"]
[{"$f":"IF(ISBLANK('Data Entry Sheet'!B8),\"\",'Data Entry Sheet'!B8)","v":""},{"$f":"IF(ISBLANK('Data Entry Sheet'!B9),\"\",'Data Entry Sheet'!B9)","v":""},{"$f":"IF(ISBLANK('Data Entry Sheet'!B10),\"\",'Data Entry Sheet'!B10)","v":""},{"$f":"'Data Entry Sheet'!B11","v":0},{"$f":"'Data Entry Sheet'!B12","v":"00:00:00"},{"$f":"IF(ISBLANK('Data Entry Sheet'!B13),\"\",'Data Entry Sheet'!B13)","v":""},{"$f":"'Data Entry Sheet'!B18","v":"."},{"$f":"'Application Form'!B11","v":""},{"$f":"'Application Form'!B12","v":""},{"$f":"HLOOKUP(TRIM(H2),K6:U8,3,FALSE)","v":{"$error":"#N/A"}},{"$f":"'Data Entry Sheet'!#REF!","v":{"$error":"#REF!"}},{"$f":"'Data Entry Sheet'!I16","v":0},{"$f":"'Data Entry Sheet'!B20","v":0},{"$f":"'Data Entry Sheet'!B23","v":""},{"$f":"'Data Entry Sheet'!B24","v":""},{"$f":"IF(ISBLANK('Data Entry Sheet'!#REF!),\"\",'Data Entry Sheet'!#REF!)","v":{"$error":"#REF!"}},{"$f":"'Data Entry Sheet'!#REF!","v":{"$error":"#REF!"}},{"$f":"'Data Entry Sheet'!#REF!","v":{"$error":"#REF!"}},{"$f":"'Data Entry Sheet'!#REF!","v":{"$error":"#REF!"}},{"$f":"'Data Entry Sheet'!#REF!","v":{"$error":"#REF!"}},{"$f":"'Data Entry Sheet'!#REF!","v":{"$error":"#REF!"}},{"$f":"'Data Entry Sheet'!#REF!","v":{"$error":"#REF!"}},{"$f":"'Data Entry Sheet'!#REF!","v":{"$error":"#REF!"}},{"$f":"'Data Entry Sheet'!#REF!","v":{"$error":"#REF!"}},{"$f":"'Data Entry Sheet'!#REF!","v":{"$error":"#REF!"}},{"$f":"'Data Entry Sheet'!#REF!","v":{"$error":"#REF!"}},{"$f":"'Data Entry Sheet'!#REF!","v":{"$error":"#REF!"}},{"$f":"'Data Entry Sheet'!#REF!","v":{"$error":"#REF!"}},{"$f":"'Data Entry Sheet'!#REF!","v":{"$error":"#REF!"}},{"$f":"'Data Entry Sheet'!#REF!","v":{"$error":"#REF!"}},{"$f":"'Data Entry Sheet'!#REF!","v":{"$error":"#REF!"}},{"$f":"'Application Form'!H16","v":0},{"$f":"'Application Form'!#REF!","v":{"$error":"#REF!"}},{"$f":"'Application Form'!J16","v":0},{"$f":"'Application Form'!H17","v":0},{"$f":"'Application Form'!I16","v":0},{"$f":"'Application Form'!J17","v":0},{"$f":"'Application Form'!H18","v":0},{"$f":"'Application Form'!I18","v":0},{"$f":"'Application Form'!J18","v":0},{"$f":"'Application Form'!H19","v":0},{"$f":"'Application Form'!I19","v":0},{"$f":"'Application Form'!J19","v":0},{"$f":"'Application Form'!H20","v":0},{"$f":"'Application Form'!I20","v":0},{"$f":"'Application Form'!J20","v":0},{"$f":"'Application Form'!H31","v":0},{"$f":"'Application Form'!I31","v":0},{"$f":"'Application Form'!J31","v":0},{"$f":"'Application Form'!H32","v":0},{"$f":"'Application Form'!I32","v":0},{"$f":"'Application Form'!J32","v":0},{"$f":"'Application Form'!H34","v":0},{"$f":"'Application Form'!I34","v":0},{"$f":"'Application Form'!J34","v":0},{"$f":"'Application Form'!H43","v":""},{"$f":"'Application Form'!I43","v":""},{"$f":"'Application Form'!J43","v":""},{"$f":"'Application Form'!H44","v":""},null,{"$f":"IF(ISBLANK('Data Entry Sheet'!B32),\"\",'Data Entry Sheet'!B32)","v":""},{"$f":"IF(ISBLANK('Data Entry Sheet'!B33),\"\",'Data Entry Sheet'!B33)","v":""},{"$f":"IF(ISBLANK('Data Entry Sheet'!B34),\"\",'Data Entry Sheet'!B34)","v":""},{"$f":"IF(ISBLANK('Data Entry Sheet'!B35),\"\",'Data Entry Sheet'!B35)","v":""},{"$f":"IF(ISBLANK('Data Entry Sheet'!B36),\"\",'Data Entry Sheet'!B36)","v":""},{"$f":"IF(ISBLANK('Data Entry Sheet'!B37),\"\",'Data Entry Sheet'!B37)","v":""},{"$f":"IF(ISBLANK('Data Entry Sheet'!B38),\"\",'Data Entry Sheet'!B38)","v":""},{"$f":"IF(ISBLANK('Data Entry Sheet'!B39),\"\",'Data Entry Sheet'!B39)","v":""},{"$f":"IF(ISBLANK('Data Entry Sheet'!B40),\"\",'Data Entry Sheet'!B40)","v":""},{"$f":"IF(ISBLANK('Data Entry Sheet'!B41),\"\",'Data Entry Sheet'!B41)","v":""},{"$f":"IF(ISBLANK('Data Entry Sheet'!#REF!),\"\",'Data Entry Sheet'!#REF!)","v":{"$error":"#REF!"}},{"$f":"IF(ISBLANK('Application Form'!N18),\"\",'Application Form'!N18)","v":""},{"$f":"IF(ISBLANK('Application Form'!N20),\"\",'Application Form'!N20)","v":""},{"$f":"IF(ISBLANK('Application Form'!N22),\"\",'Application Form'!N22)","v":""},{"$f":"IF(ISBLANK('Application Form'!N26),\"\",'Application Form'!N26)","v":""},{"$f":"IF(ISBLANK('Data Entry Sheet'!L8),\"\",'Data Entry Sheet'!L8)","v":""}]
[null,null,null,null,null,null,null,null,null,null,null,null,null,null,null,null,null,null,null,null,null,null,null,null,null,null,null,null,null,null,null,null,null,null,null,null,null,null,null,null,null,null,null,null,null,null,null,null,null,null,null,null,null,null,null,null,null,null,null,null,{"$f":"IF(ISBLANK('Data Entry Sheet'!B33),\"\",'Data Entry Sheet'!B33)","v":""}]
[null,null,null,null,null,null,null,null,null,null,null,null,null,null,null,null,null,null,null,null,null,null,null,null,null,null,null,null,null,null,null,null,null,null,null,null,null,null,null,null,null,null,null,null,null,null,null,null,null,null,null,null,null,null,null,null,null,null,null,null,{"$f":"IF(ISBLANK('Data Entry Sheet'!B34),\"\",'Data Entry Sheet'!B34)","v":""}]
[null,null,null,null,null,null,null,null,null,null,null,null,null,null,null,null,null,null,null,null,null,null,null,null,null,null,null,null,null,null,null,null,null,null,null,null,null,null,null,null,null,null,null,null,null,null,null,null,null,null,null,null,null,null,null,null,null,null,null,null,{"$f":"IF(ISBLANK('Data Entry Sheet'!B35),\"\",'Data Entry Sheet'!B35)","v":""}]
[null,null,null,null,null,null,null,null,"Convert discipline and test to test type  ","Discipline",{"$f":"'Data Entry Sheet'!B15","v":"Free Skating"},{"$f":"'Data Entry Sheet'!C15","v":0},{"$f":"'Data Entry Sheet'!D15","v":0},{"$f":"'Data Entry Sheet'!#REF!","v":{"$error":"#REF!"}},{"$f":"'Data Entry Sheet'!#REF!","v":{"$error":"#REF!"}},{"$f":"'Data Entry Sheet'!F16","v":0},{"$f":"'Data Entry Sheet'!I15","v":0},{"$f":"'Data Entry Sheet'!J15","v":0},{"$f":"'Data Entry Sheet'!K15","v":0},{"$f":"'Data Entry Sheet'!L15","v":0},{"$f":"'Data Entry Sheet'!M15","v":0},{"$f":"'Data Entry Sheet'!#REF!","v":{"$error":"#REF!"}},null,null,null,null,null,null,null,null,null,null,null,null,null,null,null,null,null,null,null,null,null,null,null,null,null,null,null,null,null,null,null,null,null,null,null,null,null,null,{"$f":"IF(ISBLANK('Data Entry Sheet'!B36),\"\",'Data Entry Sheet'!B36)","v":""}]
[null,null,null,null,null,null,null,null,null,"Prefix","D",{"$f":"IF(OR($I$2=\"BS\", $I$2=\"SS\",$I$2=\"GS\"),\"SS\",\"S\")","v":"S"},"F","FL","FS","FD","SFD","FP","IL","P","PT",null,null,null,null,null,null,null,null,null,null,null,null,null,null,null,null,null,null,null,null,null,null,null,null,null,null,null,null,null,null,null,null,null,null,null,null,null,null,null,{"$f":"IF(ISBLANK('Data Entry Sheet'!B37),\"\",'Data Entry Sheet'!B37)","v":""}]
[null,null,null,null,null,null,null,null,null,"Test Type Code",{"$f":"IF(K6=$H$2,IF(LEN($I$2)=1,K7&\"0\"&$I$2,K7&$I$2),\"\")","v":""},{"$f":"IF($L$6=$H$2,IF(LEN($I$2)=1,$L$7&\"0\"&$I$2,IF($I$2=\"BS\",\"SS1\",IF($I$2=\"SS\",\"SS2\",IF($I$2=\"GS\",\"SS3\", $L$7&$I$2)))),\"\")","v":""},{"$f":"IF(M6=$H$2,IF(LEN($I$2)=1,M7&\"0\"&$I$2,M7&$I$2),\"\")","v":""},{"$f":"IF(N6=$H$2,N7&$I$2,\"\")","v":{"$error":"#REF!"}},{"$error":"#REF!"},"","","","",{"$f":"IF(T6=$H$2,IF(LEN($I$2)=1,T7&\"0\"&$I$2,T7&$I$2),\"\")","v":""},{"$f":"IF(U6=$H$2,U7,\"\")","v":""},null,null,null,null,null,null,null,null,null,null,null,null,null,null,null,null,null,null,null,null,null,null,null,null,null,null,null,null,null,null,null,null,null,null,null,null,null,null,null,{"$f":"IF(ISBLANK('Data Entry Sheet'!B38),\"\",'Data Entry Sheet'!B38)","v":""}]
{"$rows_left_out":4}