{"text_format":"1","workbook":"xlsx","n_sheets":6,"sheets":["Instructions","Data Entry Sheet","Marking Sheet","Application Form","Test Details","CSV Export"],"not_rendered":{"charts":0,"images":3,"macros":1,"external_links":0,"defined_names":304,"comments":0,"pivot_tables":0},"unopened":[],"bounds":{"document_bytes":16777216,"sheet_cells":100000,"rows_first":2000,"rows_last":500,"rows_between":2000,"halvings":0,"cell_chars":16384,"cell_head_chars":4096},"cells_cut":0,"cells_raw":0,"read":"whole","date_system":"1900"}

{"sheet":"Instructions","index":0,"n_rows":24,"n_cols":4,"rows_kept":24,"cut":false,"hidden":false,"merged":[]}
["COMPUTER/EXCEL SET UP REQUIREMENTS"]
[]
["1.","The forms must be saved on to a computer to work successfully.  The macros won't work on a form which is opened from OneDrive or from an attachment to an email."]
[]
["2.","The computer must have Excel 2010 (or later) installed.  The macros will not work in Libre Office."]
[]
["3.","Macros must be enabled on the computer.  Open Excel then go to:"]
[null,"(a)","File | Options | Trust Centre | Turst Centre Settings"]
{"$rows_left_out":17}
{"sheet":"Data Entry Sheet","index":1,"n_rows":90,"n_cols":53,"rows_kept":90,"cut":false,"hidden":false,"merged":[[64,25,64,27],[74,25,74,27],[66,25,66,27],[69,25,69,27],[65,25,65,27],[70,25,70,27],[71,25,71,27],[72,25,72,27],[67,25,67,27],[68,25,68,27],[73,25,73,27],[7,14,9,14],[56,22,56,23],[57,22,57,23],[58,22,58,23],[59,22,59,23],[60,22,60,23],[61,22,61,23],[62,22,62,23],[63,22,63,23],[54,22,54,23],[55,22,55,23],[13,18,13,19],[12,18,12,19],[7,17,9,17],[47,20,47,22],[49,20,49,22],[44,20,44,22],[7,22,8,23],[9,22,9,23],[14,15,14,16],[54,19,54,21],[55,19,55,21],[59,19,59,21],[60,19,60,21],[17,29,17,30],[17,31,17,32],[17,34,17,35],[16,34,16,35],[13,32,13,33],[10,28,10,29],[11,28,11,29],[12,28,12,29],[13,22,13,23],[13,24,13,25],[13,26,13,27],[10,32,10,33],[11,32,11,33],[10,34,10,35],[11,34,11,35],[13,34,13,35],[12,34,12,35],[12,30,12,31],[12,32,12,33],[11,30,11,31],[12,24,12,25],[12,26,12,27],[13,28,13,29],[13,30,13,31],[39,38,39,39],[36,29,38,30],[34,43,34,45],[38,22,38,24],[34,26,34,28],[36,34,38,35],[32,26,32,28],[2,22,2,23],[6,22,6,23],[18,41,18,42],[17,41,17,42],[15,40,15,42],[16,38,16,39],[17,38,17,39],[8,30,8,31],[7,32,9,33],[8,26,8,27],[9,26,9,27],[9,30,9,31],[10,26,10,27],[10,30,10,31],[16,36,16,37],[7,26,7,27],[11,26,11,27],[41,47,41,49],[38,26,38,28],[37,26,37,28],[53,14,53,16],[53,20,53,22],[41,20,41,22],[41,14,41,16],[41,26,41,28],[45,14,45,16],[46,14,46,16],[52,14,52,16],[52,20,52,22],[50,20,50,22],[47,14,47,16],[48,14,48,16],[49,14,49,16],[50,14,50,16],[51,14,51,16],[42,14,42,16],[48,20,48,22],[45,20,45,22],[46,20,46,22],[41,43,41,45],[39,36,39,37],[40,47,40,49],[35,47,35,49],[36,47,36,49],[25,55,26,55],[27,47,27,49],[27,43,27,45],[25,46,26,46],[25,47,26,49],[24,54,26,54],[38,43,38,45],[36,43,36,45],[40,43,40,45],[35,43,35,45],[39,43,39,45],[49,6,49,11],[46,6,46,11],[28,2,28,6],[55,7,55,11],[29,2,29,6],[47,6,47,11],[44,6,44,11],[45,6,45,11],[47,1,47,5],[48,1,48,5],[49,1,49,5],[35,2,35,6],[35,7,35,11],[36,2,36,6],[53,1,53,5],[54,7,54,11],[52,1,52,5],[50,1,50,5],[51,1,51,5],[46,1,46,5],[30,7,30,11],[31,2,31,6],[31,7,31,11],[32,2,32,6],[24,9,24,11],[28,7,28,11],[29,7,29,11],[30,2,30,6],[1,1,1,11],[2,1,2,11],[11,1,11,11],[9,1,9,11],[10,1,10,11],[12,1,12,11],[17,8,17,9],[8,1,8,11],[15,3,15,6],[14,3,14,6],[16,0,16,11],[17,2,17,3],[17,5,17,6],[6,1,6,11],[3,1,5,11],[7,1,7,11],[35,26,35,28],[33,26,33,28],[36,40,36,41],[33,40,33,41],[19,8,20,9],[19,10,20,10],[18,0,18,1],[19,0,19,1],[36,7,36,11],[33,2,33,6],[33,7,33,11],[34,2,34,6],[34,7,34,11],[18,8,18,9],[27,7,27,11],[27,2,27,6],[20,0,20,1],[18,3,18,5],[19,2,19,4],[22,7,22,11],[23,7,23,8],[26,9,26,11],[23,9,23,11],[26,2,26,7],[32,7,32,11],[34,40,34,41],[31,40,31,41],[39,22,39,24],[39,26,39,28],[40,26,40,28],[17,49,17,51],[16,29,16,31],[30,43,30,45],[37,43,37,45],[32,43,32,45],[33,43,33,45],[31,43,31,45],[29,47,29,49],[30,47,30,49],[31,47,31,49],[32,47,32,49],[33,47,33,49],[37,47,37,49],[28,47,28,49],[28,43,28,45],[29,43,29,45],[34,47,34,49],[17,36,17,37],[25,40,26,41],[25,42,26,42],[27,40,27,41],[25,43,26,45],[54,28,63,28],[63,25,63,27],[61,19,61,21],[62,19,62,21],[63,19,63,21],[29,40,29,41],[30,40,30,41],[32,40,32,41],[40,40,40,41],[39,34,39,35],[36,38,38,39],[43,20,43,22],[41,40,41,41],[39,40,39,41],[38,40,38,41],[37,40,37,41],[28,40,28,41],[35,40,35,41],[36,36,38,37],[36,26,36,28],[7,36,7,42],[10,36,11,42],[12,20,12,21],[12,22,12,23],[7,20,9,21],[10,20,10,21],[11,20,11,21],[9,18,9,19],[11,18,11,19],[7,34,9,35],[7,28,9,29],[7,30,7,31],[10,22,10,23],[11,22,11,23],[7,24,9,25],[10,24,10,25],[11,24,11,25],[60,1,60,11],[37,0,37,11],[50,6,50,11],[51,6,51,11],[42,20,42,22],[41,1,41,5],[41,6,41,11],[42,6,42,11],[40,1,40,11],[38,1,38,11],[51,20,51,22],[43,14,43,16],[44,14,44,16],[40,22,40,24],[59,1,59,11],[42,1,42,5],[43,1,43,5],[44,1,44,5],[45,1,45,5],[43,6,43,11],[56,7,56,11],[52,6,52,11],[53,6,53,11],[48,6,48,11],[13,15,13,16],[10,18,10,19],[7,18,8,19],[64,19,64,21],[66,19,66,21],[82,19,82,21],[83,19,83,21],[84,19,84,21],[85,19,85,21],[12,15,12,16],[7,15,9,16],[10,15,10,16],[11,15,11,16],[13,20,13,21],[67,19,67,21],[86,19,86,21],[87,19,87,21],[89,18,90,18],[89,19,90,21],[70,19,70,21],[71,19,71,21],[72,19,72,21],[73,19,73,21],[74,19,74,21],[75,19,75,21],[77,19,77,21],[78,19,78,21]]}
[null,null,null,null,null,null,null,null,null,null,null,null,null,"Hide","Hide","Hide","Hide","Hide","Hide","Hide","Hide","Hide","Hide","Hide","Hide","Hide","Hide","Hide","Hide","Hide","Hide","Hide","Hide","Hide","Hide","Hide","Hide","Hide","Hide","Hide","Hide","Hide","Hide","Hide","Hide","Hide","Hide","Hide","Hide","Hide","Hide","Hide","Hide"]
[null,"SKATE AUSTRALIA PROFICIENCY TEST"]
[null,"DATA ENTRY SHEET",null,null,null,null,null,null,null,null,null,null,null,null,null,null,null,null,null,null,null,null,"Previous Test Date =",null,{"$f":"Previous_Test_Date","v":"."}]
[null,"SA PROFICIENCY TEST FORM NS - 2025-01 NEW STRUCTURE - FIGURES AND LOOPS\n(requires Microsoft Excel 2010 or later installed on the computer)"]
[]
[]
[null,"Cells with a blue background have a drop down list for selection of data",null,null,null,null,null,null,null,null,null,null,null,null,null,null,null,null,null,null,null,null,"Test Date = ",null,{"$f":"Test_Date","v":"00:00:00"}]
["NAME:",null,null,null,null,null,null,null,null,null,null,null,null,null,"First Figures test - no previous attempt at this test","First Loops test - no previous attempt at this test",null,"If Last Test Type is Old Figures & C","If Last Test was Old Figures & NYC",null,"If Last Test was Old Loops & C",null,"If Last Test was Old Loops & NYC",null,"If Last Test was New Figures & C",null,"Last Test New Figs & NYC",null,"If Last Test was New Loops & C",null,"Last Test New Loops & NYC",null,"Skate Ups Figures\n\nIf Last Test was New Figures & Previous Test was C",null,"Skate Ups Loops\n\nIf Last Test was New Loops & Previous Test was C",null,"Test Held"]
{"$rows_left_out":83}
{"sheet":"Marking Sheet","index":2,"n_rows":177,"n_cols":13,"rows_kept":177,"cut":false,"hidden":false,"merged":[[151,0,151,10],[174,0,175,7],[174,8,174,10],[175,8,175,10],[91,2,91,6],[102,0,103,1],[93,0,93,1],[93,2,93,6],[49,2,49,6],[90,0,90,1],[100,0,101,1],[100,2,101,5],[100,6,101,8],[100,9,101,10],[102,2,103,5],[102,6,103,8],[102,9,103,10],[104,9,105,10],[106,0,107,1],[106,2,107,5],[106,6,107,8],[106,9,107,10],[108,0,108,10],[155,0,155,10],[172,0,173,7],[47,2,47,6],[9,0,9,1],[9,2,9,3],[50,2,50,6],[44,0,44,10],[48,0,48,1],[50,0,50,1],[59,0,60,1],[65,0,65,10],[48,2,48,6],[48,7,48,8],[57,9,58,10],[59,2,60,5],[59,6,60,8],[59,9,60,10],[61,0,62,1],[61,2,62,5],[61,6,62,8],[61,9,62,10],[63,0,64,1],[63,2,64,5],[63,6,64,8],[63,9,64,10],[30,0,30,1],[1,0,1,10],[2,0,2,10],[4,0,4,1],[5,0,5,1],[4,2,4,6],[5,7,5,8],[5,2,5,6],[8,0,8,1],[8,2,8,6],[6,2,6,6],[6,0,6,1],[6,7,6,8],[7,0,7,1],[7,2,7,6],[12,9,13,10],[14,9,15,10],[16,9,17,10],[18,9,19,10],[20,9,21,10],[12,0,13,1],[14,0,15,1],[18,0,19,1],[20,0,21,1],[170,8,170,10],[171,8,171,10],[170,0,171,7],[16,0,17,1],[26,0,26,10],[23,0,23,3],[24,0,24,3],[23,4,24,10],[22,0,22,10],[36,0,36,1],[36,2,36,8],[37,0,37,1],[37,2,37,8],[38,0,38,1],[38,2,38,8],[39,0,39,1],[39,2,39,8],[40,0,40,1],[40,2,40,8],[47,0,47,1],[49,0,49,1],[27,0,27,10],[104,0,105,1],[104,2,105,5],[104,6,105,8],[122,0,122,1],[122,2,122,8],[123,0,123,1],[123,2,123,8],[124,0,124,1],[124,2,124,8],[94,0,94,1],[94,2,94,6],[95,0,95,1],[95,2,95,3],[95,8,95,10],[97,9,97,10],[98,0,99,1],[98,2,99,5],[98,6,99,8],[98,9,99,10],[109,0,109,3],[109,4,110,10],[110,0,110,3],[112,0,112,10],[113,0,113,10],[114,0,115,8],[114,9,114,10],[80,0,80,1],[80,2,80,8],[90,2,90,6],[87,0,87,10],[91,7,91,8],[92,0,92,1],[91,9,91,10],[92,7,92,8],[92,9,92,10],[81,0,81,1],[81,2,81,8],[82,0,82,1],[82,2,82,8],[83,0,83,1],[83,2,83,8],[84,0,84,1],[84,2,84,8],[88,0,88,10],[33,0,33,1],[33,2,33,8],[34,0,34,1],[34,2,34,8],[35,0,35,1],[35,2,35,8],[92,2,92,6],[91,0,91,1],[57,0,58,1],[57,2,58,5],[57,6,58,8],[74,0,74,1],[74,2,74,8],[75,0,75,1],[75,2,75,8],[76,0,76,1],[76,2,76,8],[77,0,77,1],[77,2,77,8],[78,0,78,1],[78,2,78,8],[79,0,79,1],[79,2,79,8],[41,0,41,1],[41,2,41,8],[9,8,9,10],[45,0,45,10],[48,9,48,10],[5,9,5,10],[6,9,6,10],[28,9,28,10],[28,0,29,8],[31,0,31,1],[30,2,30,8],[31,2,31,8],[32,0,32,1],[32,2,32,8],[12,6,13,8],[14,6,15,8],[16,6,17,8],[18,6,19,8],[20,6,21,8],[12,2,13,5],[14,2,15,5],[16,2,17,5],[18,2,19,5],[20,2,21,5],[11,9,11,10],[49,7,49,8],[49,9,49,10],[51,0,51,1],[51,2,51,6],[52,0,52,1],[52,2,52,3],[52,8,52,10],[54,9,54,10],[55,0,56,1],[55,2,56,5],[55,6,56,8],[55,9,56,10],[66,0,66,3],[66,4,67,10],[67,0,67,3],[69,0,69,10],[70,0,70,10],[71,0,72,8],[71,9,71,10],[73,0,73,1],[73,2,73,8],[116,0,116,1],[116,2,116,8],[117,0,117,1],[117,2,117,8],[118,0,118,1],[118,2,118,8],[119,0,119,1],[119,2,119,8],[120,0,120,1],[120,2,120,8],[121,0,121,1],[121,2,121,8],[125,0,125,1],[125,2,125,8],[126,0,126,1],[126,2,126,8],[127,0,127,1],[127,2,127,8],[130,0,130,10],[149,9,150,10],[131,0,131,10],[133,0,133,1],[133,2,133,6],[145,6,146,8],[145,9,146,10],[147,0,148,1],[147,2,148,5],[147,6,148,8],[147,9,148,10],[134,0,134,1],[134,2,134,6],[134,7,134,8],[134,9,134,10],[135,0,135,1],[135,2,135,6],[135,7,135,8],[135,9,135,10],[136,0,136,1],[136,2,136,6],[152,0,152,3],[152,4,153,10],[153,0,153,3],[156,0,157,8],[156,9,156,10],[137,0,137,1],[137,2,137,6],[138,0,138,1],[138,2,138,3],[138,8,138,10],[140,9,140,10],[141,0,142,1],[141,2,142,5],[141,6,142,8],[141,9,142,10],[143,0,144,1],[143,2,144,5],[143,6,144,8],[143,9,144,10],[145,0,146,1],[145,2,146,5],[149,0,150,1],[149,2,150,5],[149,6,150,8],[158,0,158,1],[158,2,158,8],[159,0,159,1],[159,2,159,8],[160,0,160,1],[160,2,160,8],[161,0,161,1],[161,2,161,8],[162,0,162,1],[162,2,162,8],[168,0,168,1],[168,2,168,8],[169,0,169,1],[169,2,169,8],[163,0,163,1],[163,2,163,8],[164,0,164,1],[164,2,164,8],[165,0,165,1],[165,2,165,8],[166,0,166,1],[166,2,166,8],[167,0,167,1],[167,2,167,8]]}
[]
["SKATE AUSTRALIA PROFICIENCY TEST"]
["MARKING SHEET"]
[]
[{"$f":"Label_Name","v":"NAME:"},null,{"$f":"Skater_Name","v":0}]
[{"$f":"Label_Club","v":"CLUB:"},null,{"$f":"Club","v":0},null,null,null,null,{"$f":"Label_SA_No","v":"SA NO:"},null,{"$f":"SA_Number","v":0}]
[{"$f":"Label_Test_Centre","v":"TEST CENTRE:"},null,{"$f":"Test_Centre","v":0},null,null,null,null,{"$f":"Label_Test_Date","v":"TEST DATE:"},null,{"$f":"Test_Date","v":"00:00:00"}]
["PARTNER",null,{"$f":"Partner","v":0}]
{"$rows_left_out":170}
{"sheet":"Application Form","index":3,"n_rows":44,"n_cols":20,"rows_kept":44,"cut":false,"hidden":false,"merged":[[20,7,21,7],[13,0,13,1],[6,8,6,9],[12,1,12,4],[6,1,6,4],[10,1,10,4],[11,1,11,4],[18,0,19,0],[18,1,19,6],[20,0,21,0],[20,1,21,6],[20,8,21,8],[18,7,19,7],[18,8,19,8],[24,0,25,0],[24,1,25,6],[24,9,25,9],[14,2,14,4],[14,0,14,1],[14,7,14,9],[14,5,14,6],[16,7,16,9],[16,0,17,6],[20,9,21,9],[22,0,23,0],[22,1,23,6],[22,7,23,7],[22,8,23,8],[22,9,23,9],[18,9,19,9],[26,9,27,9],[24,7,25,7],[24,8,25,8],[43,7,44,9],[1,0,1,9],[2,0,2,9],[7,8,7,9],[7,6,7,7],[7,1,7,4],[8,8,8,9],[13,7,13,9],[8,6,8,7],[8,1,8,4],[9,1,9,4],[13,5,13,6],[13,2,13,4],[26,1,27,6],[42,0,42,4],[42,5,42,6],[43,0,44,2],[26,8,27,8],[26,0,27,0],[26,7,27,7],[18,15,18,19],[20,15,20,19],[22,15,22,19],[24,15,24,19],[26,15,26,19]]}
[null,null,null,null,null,null,null,null,null,null,null,null,null,null,null,"Hide","Hide","Hide","Hide","Hide"]
["SKATE AUSTRALIA PROFICIENCY TEST"]
["APPLICATION FORM"]
[]
[]
[]
[{"$f":"Label_Name","v":"NAME:"},{"$f":"Skater_Name","v":0}]
[{"$f":"Label_Club","v":"CLUB:"},{"$f":"Club","v":0},null,null,null,null,{"$f":"Label_SA_No","v":"SA NO:"},null,{"$f":"SA_Number","v":0}]
{"$rows_left_out":37}
{"sheet":"Test Details","index":4,"n_rows":601,"n_cols":18,"rows_kept":601,"cut":false,"hidden":true,"merged":[[158,0,158,1]]}
["Test #",null,"Item #","Full Item - D:R - 1","Fig #  D:R - 2","Item Description - Normal  D:R - 3","Fig #  D:R - 4","Transition 1  D:R - 5","Fig #  D:R - 6","Transition 2  D:R - 7","Fig #  D:R - 8","Figures - Foot Draw - a Foot  D:R - 9","Fig #  D:R - 10","Figures - Foot Draw - b Foot  D:R - 11","Minimum Mark  D:R - 12","Passing Grade  D:R - 13","Maximum Time  D:R - 14","Award  D:R - 15"]
["Couples Dance"]
["Test #",null,"Item #","Full Item","Fig #","Item Description - Normal","Fig #",{"$f":"+H1","v":"Transition 1  D:R - 5"},"Fig #",{"$f":"+J1","v":"Transition 2  D:R - 7"},null,{"$f":"+L1","v":"Figures - Foot Draw - a Foot  D:R - 9"},null,{"$f":"+N1","v":"Figures - Foot Draw - b Foot  D:R - 11"},"Minimum Mark","Passing Grade","Maximum Time","Award"]
[1,{"$f":"$A$2&A4","v":"Couples Dance1"},"1.",{"$f":"B4&C4","v":"Couples Dance11."},null,"Glide Waltz - 120 Waltz",null,"Glide Waltz - 120 Waltz",null,"Glide Waltz - 120 Waltz",null,"Glide Waltz - 120 Waltz",null,"Glide Waltz - 120 Waltz",5,11,null,"1st Bronze Bar"]
[1,{"$f":"$A$2&A5","v":"Couples Dance1"},{"$f":"IF(B5=B4,TEXT(VALUE(C4)+1,\"#\")&\".\",\"1.\")","v":"2."},{"$f":"B5&C5","v":"Couples Dance12."},null,"Masters Tango - 100 Tango",null,"Masters Tango - 100 Tango",null,"Masters Tango - 100 Tango",null,"Masters Tango - 100 Tango",null,"Masters Tango - 100 Tango"]
[2,{"$f":"$A$2&A6","v":"Couples Dance2"},{"$f":"IF(B6=B5,TEXT(VALUE(C5)+1,\"#\")&\".\",\"1.\")","v":"1."},{"$f":"B6&C6","v":"Couples Dance21."},null,"Society Blues - 88 Blues",null,"Society Blues - 88 Blues",null,"Society Blues - 88 Blues",null,"Society Blues - 88 Blues",null,"Society Blues - 88 Blues",5,12,null,"2nd Bronze Bar"]
[2,"Couples Dance2","2.","Couples Dance22.",null,"Skaters March - 100 March",null,"Skaters March - 100 March",null,"Skaters March - 100 March",null,"Skaters March - 100 March",null,"Skaters March - 100 March"]
[3,"Couples Dance3","1.","Couples Dance31.",null,"Canasta Tango - 100 Tango",null,"Canasta Tango - 100 Tango",null,"Canasta Tango - 100 Tango",null,"Canasta Tango - 100 Tango",null,"Canasta Tango - 100 Tango",5,18,null,"3rd Bronze Bar"]
{"$rows_left_out":594}
{"sheet":"CSV Export","index":5,"n_rows":12,"n_cols":76,"rows_kept":12,"cut":false,"hidden":true,"merged":[]}
["Name","Member #","Club","Venue","Test Date ","Partner","Date of Previous Test","Discipline","Test","Test Type","Award","Fee","Max Time","Min Mark","Passing Grade","Fig Num1","Item Desc1","Fig Num2","Item Desc2","Fig Num3","Item Desc3","Fig Num4","Item Desc4","Fig Num5","Item Desc5","Fig Num6","Item Desc6","Fig Num7","Item Desc7","Fig Num8","Item Desc8","Mark11","Mark21","Mark31","Mark12","Mark22","Mark32","Mark13","Mark23","Mark33","Mark14","Mark24","Mark34","Mark15","Mark25","Mark35","Mark16","Mark26","Mark36","Mark17","Mark27","Mark37","Mark18","Mark28","Mark38","Total1","Total2","Total3","Result","Comments","Content1","Content2","Content3","Content4","Content5","Content6","Content7","Content8","Content9","Content10","Content11","Judge1","Judge2","Judge3","Referee","Gender"]
[{"$f":"IF(ISBLANK('Data Entry Sheet'!B8),\"\",'Data Entry Sheet'!B8)","v":""},{"$f":"IF(ISBLANK('Data Entry Sheet'!B9),\"\",'Data Entry Sheet'!B9)","v":""},{"$f":"IF(ISBLANK('Data Entry Sheet'!B10),\"\",'Data Entry Sheet'!B10)","v":""},{"$f":"'Data Entry Sheet'!B11","v":0},{"$f":"'Data Entry Sheet'!B12","v":"00:00:00"},{"$f":"IF(ISBLANK('Data Entry Sheet'!B13),\"\",'Data Entry Sheet'!B13)","v":""},{"$f":"'Data Entry Sheet'!B18","v":"."},{"$f":"'Application Form'!B11","v":0},{"$f":"'Application Form'!B12","v":""},{"$f":"HLOOKUP(TRIM(H2),K6:U8,3,FALSE)","v":{"$error":"#N/A"}},{"$f":"'Data Entry Sheet'!#REF!","v":{"$error":"#REF!"}},{"$f":"'Data Entry Sheet'!I16","v":0},{"$f":"'Data Entry Sheet'!B21","v":0},{"$f":"'Data Entry Sheet'!B23","v":""},{"$f":"'Data Entry Sheet'!B24","v":""},{"$f":"IF(ISBLANK('Data Entry Sheet'!B28),\"\",'Data Entry Sheet'!B28)","v":""},{"$f":"'Data Entry Sheet'!C28","v":""},{"$f":"'Data Entry Sheet'!B29","v":""},{"$f":"'Data Entry Sheet'!C29","v":""},{"$f":"'Data Entry Sheet'!B30","v":""},{"$f":"'Data Entry Sheet'!C30","v":""},{"$f":"'Data Entry Sheet'!B31","v":""},{"$f":"'Data Entry Sheet'!C31","v":""},{"$f":"'Data Entry Sheet'!B32","v":""},{"$f":"'Data Entry Sheet'!C32","v":""},{"$f":"'Data Entry Sheet'!B33","v":0},{"$f":"'Data Entry Sheet'!C33","v":"Hide"},{"$f":"'Data Entry Sheet'!B34","v":0},{"$f":"'Data Entry Sheet'!C34","v":"Hide"},{"$f":"'Data Entry Sheet'!B35","v":0},{"$f":"'Data Entry Sheet'!C35","v":"Hide"},{"$f":"'Application Form'!H19","v":""},{"$f":"'Application Form'!#REF!","v":{"$error":"#REF!"}},{"$f":"'Application Form'!J19","v":""},{"$f":"'Application Form'!H20","v":0},{"$f":"'Application Form'!I19","v":""},{"$f":"'Application Form'!J20","v":0},{"$f":"'Application Form'!H21","v":""},{"$f":"'Application Form'!I21","v":""},{"$f":"'Application Form'!J21","v":""},{"$f":"'Application Form'!H22","v":0},{"$f":"'Application Form'!I22","v":0},{"$f":"'Application Form'!J22","v":0},{"$f":"'Application Form'!H23","v":""},{"$f":"'Application Form'!I23","v":""},{"$f":"'Application Form'!J23","v":""},{"$f":"'Application Form'!H24","v":0},{"$f":"'Application Form'!I24","v":0},{"$f":"'Application Form'!J24","v":0},{"$f":"'Application Form'!H25","v":""},{"$f":"'Application Form'!I25","v":""},{"$f":"'Application Form'!J25","v":""},{"$f":"'Application Form'!H27","v":""},{"$f":"'Application Form'!I27","v":""},{"$f":"'Application Form'!J27","v":""},{"$f":"'Application Form'!H43","v":""},{"$f":"'Application Form'!I43","v":""},{"$f":"'Application Form'!J43","v":""},{"$f":"'Application Form'!H44","v":""},null,{"$f":"IF(ISBLANK('Data Entry Sheet'!B43),\"\",'Data Entry Sheet'!B43)","v":""},{"$f":"IF(ISBLANK('Data Entry Sheet'!B44),\"\",'Data Entry Sheet'!B44)","v":""},{"$f":"IF(ISBLANK('Data Entry Sheet'!B45),\"\",'Data Entry Sheet'!B45)","v":""},{"$f":"IF(ISBLANK('Data Entry Sheet'!B46),\"\",'Data Entry Sheet'!B46)","v":""},{"$f":"IF(ISBLANK('Data Entry Sheet'!B47),\"\",'Data Entry Sheet'!B47)","v":""},{"$f":"IF(ISBLANK('Data Entry Sheet'!B48),\"\",'Data Entry Sheet'!B48)","v":""},{"$f":"IF(ISBLANK('Data Entry Sheet'!B49),\"\",'Data Entry Sheet'!B49)","v":""},{"$f":"IF(ISBLANK('Data Entry Sheet'!B50),\"\",'Data Entry Sheet'!B50)","v":""},{"$f":"IF(ISBLANK('Data Entry Sheet'!B51),\"\",'Data Entry Sheet'!B51)","v":""},{"$f":"IF(ISBLANK('Data Entry Sheet'!B52),\"\",'Data Entry Sheet'!B52)","v":""},{"$f":"IF(ISBLANK('Data Entry Sheet'!#REF!),\"\",'Data Entry Sheet'!#REF!)","v":{"$error":"#REF!"}},{"$f":"IF(ISBLANK('Application Form'!N18),\"\",'Application Form'!N18)","v":""},{"$f":"IF(ISBLANK('Application Form'!N19),\"\",'Application Form'!N19)","v":""},{"$f":"IF(ISBLANK('Application Form'!N20),\"\",'Application Form'!N20)","v":""},{"$f":"IF(ISBLANK('Application Form'!N23),\"\",'Application Form'!N23)","v":""},{"$f":"IF(ISBLANK('Data Entry Sheet'!L8),\"\",'Data Entry Sheet'!L8)","v":""}]
[null,null,null,null,null,null,null,null,null,null,null,null,null,null,null,null,null,null,null,null,null,null,null,null,null,null,null,null,null,null,null,null,null,null,null,null,null,null,null,null,null,null,null,null,null,null,null,null,null,null,null,null,null,null,null,null,null,null,null,null,{"$f":"IF(ISBLANK('Data Entry Sheet'!B44),\"\",'Data Entry Sheet'!B44)","v":""}]
[null,null,null,null,null,null,null,null,null,null,null,null,null,null,null,null,null,null,null,null,null,null,null,null,null,null,null,null,null,null,null,null,null,null,null,null,null,null,null,null,null,null,null,null,null,null,null,null,null,null,null,null,null,null,null,null,null,null,null,null,{"$f":"IF(ISBLANK('Data Entry Sheet'!B45),\"\",'Data Entry Sheet'!B45)","v":""}]
[null,null,null,null,null,null,null,null,null,null,null,null,null,null,null,null,null,null,null,null,null,null,null,null,null,null,null,null,null,null,null,null,null,null,null,null,null,null,null,null,null,null,null,null,null,null,null,null,null,null,null,null,null,null,null,null,null,null,null,null,{"$f":"IF(ISBLANK('Data Entry Sheet'!B46),\"\",'Data Entry Sheet'!B46)","v":""}]
[null,null,null,null,null,null,null,null,"Convert discipline and test to test type  ","Discipline",{"$f":"'Data Entry Sheet'!B15","v":"Figures"},{"$f":"'Data Entry Sheet'!C15","v":"Loops"},{"$f":"'Data Entry Sheet'!D15","v":""},{"$f":"'Data Entry Sheet'!#REF!","v":{"$error":"#REF!"}},{"$f":"'Data Entry Sheet'!#REF!","v":{"$error":"#REF!"}},{"$f":"'Data Entry Sheet'!F16","v":0},{"$f":"'Data Entry Sheet'!H15","v":0},{"$f":"'Data Entry Sheet'!I15","v":0},{"$f":"'Data Entry Sheet'!J15","v":0},{"$f":"'Data Entry Sheet'!K15","v":0},{"$f":"'Data Entry Sheet'!L15","v":0},{"$f":"'Data Entry Sheet'!M15","v":0},null,null,null,null,null,null,null,null,null,null,null,null,null,null,null,null,null,null,null,null,null,null,null,null,null,null,null,null,null,null,null,null,null,null,null,null,null,null,{"$f":"IF(ISBLANK('Data Entry Sheet'!B47),\"\",'Data Entry Sheet'!B47)","v":""}]
[null,null,null,null,null,null,null,null,null,"Prefix","D",{"$f":"IF(OR($I$2=\"BS\", $I$2=\"SS\",$I$2=\"GS\"),\"SS\",\"S\")","v":"S"},"F","FL","FS","FD","SFD","FP","IL","P","PT",null,null,null,null,null,null,null,null,null,null,null,null,null,null,null,null,null,null,null,null,null,null,null,null,null,null,null,null,null,null,null,null,null,null,null,null,null,null,null,{"$f":"IF(ISBLANK('Data Entry Sheet'!B48),\"\",'Data Entry Sheet'!B48)","v":""}]
[null,null,null,null,null,null,null,null,null,"Test Type Code",{"$f":"IF(K6=$H$2,IF(LEN($I$2)=1,K7&\"0\"&$I$2,K7&$I$2),\"\")","v":""},{"$f":"IF($L$6=$H$2,IF(LEN($I$2)=1,$L$7&\"0\"&$I$2,IF($I$2=\"BS\",\"SS1\",IF($I$2=\"SS\",\"SS2\",IF($I$2=\"GS\",\"SS3\", $L$7&$I$2)))),\"\")","v":""},{"$f":"IF(M6=$H$2,IF(LEN($I$2)=1,M7&\"0\"&$I$2,M7&$I$2),\"\")","v":""},{"$f":"IF(N6=$H$2,N7&$I$2,\"\")","v":{"$error":"#REF!"}},{"$error":"#REF!"},"FD","SFD","FP","IL",{"$f":"IF(T6=$H$2,IF(LEN($I$2)=1,T7&\"0\"&$I$2,T7&$I$2),\"\")","v":"P"},{"$f":"IF(U6=$H$2,U7,\"\")","v":"PT"},null,null,null,null,null,null,null,null,null,null,null,null,null,null,null,null,null,null,null,null,null,null,null,null,null,null,null,null,null,null,null,null,null,null,null,null,null,null,null,{"$f":"IF(ISBLANK('Data Entry Sheet'!B49),\"\",'Data Entry Sheet'!B49)","v":""}]
{"$rows_left_out":4}